{"text_format":"1","workbook":"xlsx","n_sheets":9,"sheets":["Facts","Unit","PDC","FS","OpBudg","CF","County","BoardSummary","CreditInfo"],"not_rendered":{"charts":0,"images":0,"macros":1,"external_links":1,"defined_names":388,"comments":2,"pivot_tables":0},"unopened":[],"bounds":{"document_bytes":16777216,"sheet_cells":100000,"rows_first":2000,"rows_last":500,"rows_between":2000,"halvings":0,"cell_chars":16384,"cell_head_chars":4096},"cells_cut":0,"cells_raw":0,"read":"whole","date_system":"1900"}

{"sheet":"Facts","index":0,"n_rows":43,"n_cols":8,"rows_kept":43,"cut":false,"hidden":false,"merged":[[0,1,0,4],[1,1,1,7],[36,5,42,6]]}
[null,{"$f":"Facts_Project_Name & \", \" & TEXT(Facts_Application_Number, \"APP18-0000\")","v":", APP24-000"}]
[null,"Project Fact Sheet"]
[]
[null,"Target Population:",null,null,"Application # :","APP24-000"]
[null,"Project Name:",null,null,"Low-Income Units:",{"$f":"LowIncomeUnits","v":0}]
[null,"City:",null,null,"Market Units:",{"$f":"MarketUnits","v":0}]
[null,"County:",null,null,"Site Acreage:"]
[null,"Applicant:",null,null,"Median Income:",{"$f":"VLOOKUP(Facts_County,County!A:D,3,FALSE)","v":{"$error":"#N/A"}}]
[null,"Contractor:",null,null,"Selection:"]
[]
[]
[]
[null,"Project Development Costs",null,null,"Total","Per Unit","Percent"]
[null,"Construction (PDC lines 3-10, 27)",null,null,{"$f":"SUM(PDC!C8:C17)+PDC!C47","v":0},{"$f":"IF(E14=0,0,E14/(LowIncomeUnits+MarketUnits))","v":0},{"$f":"IF(E14=0,0,E14/$E$23)","v":0}]
[null,"Site Improvements (PDC line 2)",null,null,{"$f":"PDC!C6+PDC!C7","v":0},{"$f":"IF(E15=0,0,E15/(LowIncomeUnits+MarketUnits))","v":0},{"$f":"IF(E15=0,0,E15/$E$23)","v":0}]
[null,"Purchase of Building(s) (PDC line 1)",null,null,{"$f":"PDC!C5","v":0},0,0]
[null,"Soft Costs (PDC lines 11-16, 18-22, 28, 30)",null,null,{"$f":"SUM(PDC!C19:C35)+SUM(PDC!C37:C44)+PDC_Furnishings_and_Equipment+PDC_Rent_up_Expenses+PDC_Specify_Other_Non_Basis_Expense1+PDC_Specify_Other_Non_Basis_Expense2-PDC_Impact_Fees+PDC!C49+PDC!C50","v":0},{"$f":"IF(LowIncomeUnits=0,0,E17/(LowIncomeUnits+MarketUnits))","v":0},0]
[null,"Developer's Fee (PDC line 28)",null,null,{"$f":"PDC!C48","v":0},0,0]
[null,"Total Development Cost",null,null,{"$f":"SUM(E14:E18)","v":0},{"$f":"IF(LowIncomeUnits=0,0,E19/(LowIncomeUnits+MarketUnits))","v":0},0]
[null,"Water, Sewer and Impact Fees (PDC line 17)",null,null,{"$f":"PDC_Impact_Fees","v":0},0,{"$f":"IF(E20=0,0,E20/$E$23)","v":0}]
[null,"Reserves (PDC lines 31-33)",null,null,{"$f":"SUM(PDC!C55:'PDC'!C58)","v":0},{"$f":"IF(E21=0,0,E21/(LowIncomeUnits+MarketUnits))","v":0},{"$f":"IF(E21=0,0,E21/$E$23)","v":0}]
[null,"Land Cost (PDC line 34)",null,null,{"$f":"PDC_Land_Cost","v":0},{"$f":"IF(E22=0,0,E22/(LowIncomeUnits+MarketUnits))","v":0},{"$f":"IF(E22=0,0,E22/$E$23)","v":0}]
[null,"Total Replacement Cost",null,null,{"$f":"SUM(E19:E22)","v":0},{"$f":"IF(LowIncomeUnits=0,0,E23/(LowIncomeUnits+MarketUnits))","v":0},0]
[]
[null,"Project Funding Sources",null,null,"Amount","Rate","Term","Percent"]
[null,"Bank Loan",null,null,{"$f":"FS_BankLoan_Amount","v":0},{"$f":"FS!E5/100","v":0},{"$f":"FS!F5","v":0},{"$f":"FS!D5","v":""}]
[null,"RPLP Loan",null,null,{"$f":"FS_RPPLoan_Amount","v":0},{"$f":"FS!E6/100","v":0},{"$f":"FS!F6","v":0},{"$f":"FS!D6","v":""}]
[null,"Local Government",null,null,{"$f":"FS_LocGovLoan_Amount","v":0},{"$f":"FS!E7/100","v":0},{"$f":"FS!F7","v":0},{"$f":"FS!D7","v":""}]
[null,"RD 515 Loan",null,null,{"$f":"FS!C8","v":0},{"$f":"FS!E8/100","v":0},{"$f":"FS!F8","v":0},{"$f":"FS!D8","v":""}]
[null,"RD 538 Loan",null,null,{"$f":"FS!C9","v":0},{"$f":"FS!E9/100","v":0},{"$f":"FS!F9","v":0},{"$f":"FS!D9","v":""}]
{"$rows_left_out":14}
{"sheet":"Unit","index":1,"n_rows":31,"n_cols":15,"rows_kept":31,"cut":false,"hidden":false,"merged":[[1,1,1,14]]}
[null,{"$f":"Facts_Project_Name & \",  \" & TEXT(Facts_Application_Number, \"APP05-0000\")","v":",  APP24-000"}]
[null,"Unit Mix and Rent Structure"]
[]
[null,"Low Income Units"]
[null,"Bedrooms","Number of Units","Type","Square Feet","Estimated Monthly Rent Recvd by Owner","Estimated Utilities Cost Not Included in Rent","Estimated Required Monthly Services Fees","Total Monthly Housing Cost to Tenant","HH Adjust.","Affordable To","% Med","HOME Trend?","1st Year Revenue","HOME Rents"]
[null,null,null,null,null,null,null,null,{"$f":"F6+G6","v":0},{"$f":"IF(ISBLANK(B6),\"\",VLOOKUP(B6,$B$27:$C$31,2,FALSE))","v":""},{"$f":"I6*12/30%","v":0},{"$f":"IF(B6=\"\",\"-\",K6/(CountyMedianIncome*J6))","v":"-"},null,{"$f":"F6*C6*12","v":0}]
[null,null,null,null,null,null,null,null,0,{"$f":"IF(ISBLANK(B7),\"\",VLOOKUP(B7,$B$27:$C$31,2,FALSE))","v":""},0,"-",null,0]
[null,null,null,null,null,null,null,null,{"$f":"F8+G8","v":0},"",{"$f":"I8*12/30%","v":0},"-",null,{"$f":"F8*C8*12","v":0}]
[null,null,null,null,null,null,null,null,0,"",0,"-",null,0]
[null,null,null,null,null,null,null,null,0,"",0,"-",null,0]
[null,null,null,null,null,null,null,null,{"$f":"F11+G11","v":0},"",{"$f":"I11*12/30%","v":0},"-",null,{"$f":"F11*C11*12","v":0}]
[null,"Total Units",{"$f":"SUM(C6:C11)","v":0},null,null,null,null,null,null,null,null,"Total",null,{"$f":"SUM(N6:N11)","v":0},{"$f":"SUM(O6:O11)","v":0}]
[]
[null,"Market Rate Units"]
[null,"Bedrooms","Number of Units","Type","Square Feet","Estimated Monthly Rent Recvd by Owner","Estimated Utilities Cost Not Included in Rent","Estimated Required Monthly Services Fees","Total Monthly Housing Cost to Tenant","HH Adjust.","Affordable To","% Med",null,"1st Year Revenue"]
[null,null,null,null,null,null,null,null,{"$f":"F16+G16","v":0},{"$f":"IF(ISBLANK(B16),\"\",VLOOKUP(B16,$B$27:$C$31,2,FALSE))","v":""},{"$f":"I16*12/30%","v":0},{"$f":"IF(B16=\"\",\"-\",K16/(CountyMedianIncome*J16))","v":"-"},null,{"$f":"F16*C16*12","v":0}]
[null,null,null,null,null,null,null,null,0,"",0,"-",null,0]
[null,null,null,null,null,null,null,null,0,"",0,"-",null,0]
[null,null,null,null,null,null,null,null,0,"",0,"-",null,0]
[null,null,null,null,null,null,null,null,0,"",0,"-",null,0]
[null,null,null,null,null,null,null,null,0,"",0,"-",null,0]
[null,"Total Units",{"$f":"SUM(C16:C21)","v":0},null,null,null,null,null,null,null,null,"Total",null,{"$f":"SUM(N16:N21)","v":0}]
[]
[]
[null,"HH Adjustments"]
[null,"Bedrooms","Adjust."]
[null,"EFF",0.7]
[null,1,0.75]
[null,2,0.9]
[null,3,1.04]
{"$rows_left_out":2}
{"sheet":"PDC","index":2,"n_rows":75,"n_cols":8,"rows_kept":75,"cut":false,"hidden":false,"merged":[[50,4,57,5],[1,1,1,5],[2,4,2,5],[17,4,17,5],[29,4,35,5],[38,4,39,5],[41,4,44,5]]}
[null,{"$f":"Facts_Project_Name & \",  \" & TEXT(Facts_Application_Number, \"APP05-0000\")","v":",  APP24-000"}]
[null,"Project Development Costs"]
[null,null,null,null,"Eligible Basis"]
[null,"Cost Element","Total Cost",null,"30% PV","70% PV"]
[" ","1.    Purchase of Building(s)"]
[null,"2.    Demolition"]
[null,"3.    On-site Improvements"]
[null,"3.    Rehabilitation"]
[null,"5.    Construction of New Building(s)"]
[null,"6.    Accessory Building(s)"]
[null,"4.    General Requirements (max 6% lines 2-3)",null,{"$f":"IF(ISBLANK(C11),0,ROUND(C11/SUM(C6:C10),6))","v":0}]
[null,"5.    Contractor Overhead (max 2% lines 2-4)",null,{"$f":"IF(ISBLANK(C12),0,ROUND(C12/SUM(C6:C11),6))","v":0}]
[null,"6.    Contractor Profit (max 8% lines 2-4; 6% if Identity of Interest)",null,{"$f":"IF(ISBLANK(C13),0,ROUND(C13/SUM(C6:C11),6))","v":0}]
[null,"7.  Construction Contingency (max 10% lines 2-6)",null,{"$f":"IF(ISBLANK(C14),0,ROUND(C14/SUM(C6:C13),6))","v":0}]
[null,"8.  Architect's Fee - PNA/SOW (8+9 = max 3% lines 2-7)"]
[null,"9.  Architect's Fee - Inspection",null,{"$f":"IF(ISBLANK(C15),0,ROUND((C15+C16)/SUM(C6:C14),6))","v":0}]
[null,"10.  Engineering Costs"]
[null,"       Subtotal  (lines 1 through 10)",{"$f":"SUM(C5:C17)","v":0}]
[null,"11.  Construction Insurance (prorate)"]
[null,"12.  Construction Loan Origination Fee (prorate)"]
[null,"13.  Construction Loan Interest (prorate)"]
[null,"14.  Construction Loan Credit Enhancement (prorate)"]
[null,"15.  Construction Period Taxes (prorate)"]
[null,"16.  Building Permit Fee"]
[null,"17.  Water, Sewer and Impact Fees"]
[null,"18.  Survey"]
[null,"19.  Property Appraisal"]
[null,"20.  Environmental Report"]
[null,"24.  Market Study"]
[null,"25.  Bond Costs"]
{"$rows_left_out":46}
{"sheet":"FS","index":3,"n_rows":35,"n_cols":9,"rows_kept":35,"cut":false,"hidden":false,"merged":[[25,1,25,2],[0,1,0,2],[25,4,25,7],[29,4,29,6],[1,1,1,6],[6,10,6,11],[26,4,26,6],[27,4,27,6],[28,4,28,6],[18,4,18,5],[19,4,19,5],[20,4,20,5]]}
[null,{"$f":"Facts_Project_Name & \",  \" & TEXT(Facts_Application_Number, \"APP05-0000\")","v":",  APP24-000"}]
[null,"Project Funding Sources"]
[]
[null,"Source \n(Existing and Future Sources)","Amount","% of   Total","Rate","Term","Amort     Period","Annual DS","Existing or Future (/Proposed) Source?"]
[null,"Bank Loan",null,{"$f":"IF(C5=0,\"\",C5/$C$23)","v":""}]
[null,"RPLP Loan",null,""]
[null,"Local Government Loan",null,""]
[null,"RD 515 Loan",null,""]
[null,"RD 538 Loan",null,""]
[null,"AHP Loan",null,""]
[null,"Other Loan (specify)",null,""]
[null,"Other Loan (specify)",null,""]
[null,"Other Loan (specify)",null,""]
[null,"RD 515 Assumed"]
[null,"Tax Exempt Bond",null,""]
[null,"Workforce Housing Loan",null,"",0,30,30]
[null,"Federal LIHTC Equity",null,""]
[null,"Non-Repayable Grant",null,""]
[null,"Historic Tax Credit Equity",null,""]
[null,"Deferred Developer Fee",null,"",{"$f":"IF(FS_DeferredDevFees_Amount=0,\"\",ROUND(PDC_Developers_Fee/2,0))","v":""},null,{"$f":"IF(FS_DeferredDevFees_Amount=0,\"\",\"Max Deferred Fee\")","v":""}]
[null,"Owner Investment",null,"",{"$f":"IF(FS_DeferredDevFees_Amount=0,\"\",FS_DeferredDevFees_Amount/PDC!C48)","v":""},null,{"$f":"IF(FS_DeferredDevFees_Amount=0,\"\",\"Percent Deferred\")","v":""}]
[null,"Other (specify)",null,""]
[null,"Total Sources",{"$f":"ROUND(SUM(C5:C22),0)","v":0},{"$f":"IF(C23=0,\"\",SUM(D5:D22))","v":""}]
[null,{"$f":"IF(C24=\"\",\"\",IF(C24>0, \"Additional funds needed to balance\",\"Reduce sources to balance\"))","v":""},{"$f":"IF(PDC!C73-C23=0,\"\",+PDC!C73-C23)","v":""}]
[]
[null,"Federal LIHTC Equity Calculator",null,null,"Workforce Housing Loan Calculator"]
[null,"Federal Tax Credits",{"$f":"IF(PDC!C70=0,0,(IF(PDC!C71>0,IF(PDC!C71<PDC!C70,PDC!C71,PDC!C70),PDC!C70)))","v":0},null,"Total Eligible Basis",null,null,{"$f":"IF(FS_TEBondLoan_Amount>0,0,PDC!C64)","v":0}]
[null,"Limited Partner Interest",null,null,"County Income Designation",null,null,{"$f":"IF(Facts_County=\"\",\"\",getCountyDesignation(Facts_County))","v":""}]
[null,"Estimated pricing on sale of Credits",null,null,"WHLP Factor",null,null,{"$f":"IF(H27=0,\"\",IF(H28=\"O\",0,(IF(H28=\"H\",\"4%\",IF(H28=\"M\",\"12%\",IF(H28=\"L\",\"20%\",\"\"))))))","v":""}]
[null,"Total Federal Credit Equity",{"$f":"IF(C27>0,ROUND(C27*10*C28*C29,0),\"\")","v":""},null,"Total Workforce Housing Loan",null,null,{"$f":"IF(H27>0,ROUND(H27*H29,0),\"\")","v":""}]
{"$rows_left_out":6}
{"sheet":"OpBudg","index":4,"n_rows":72,"n_cols":6,"rows_kept":72,"cut":false,"hidden":false,"merged":[[62,1,62,5],[63,1,71,1],[67,2,67,4],[59,1,61,1],[70,2,70,4],[66,2,66,4],[69,2,69,4],[63,2,63,4],[64,2,64,4],[65,2,65,4],[59,2,59,4],[61,2,61,4],[60,2,60,4],[68,2,68,4],[72,2,72,4],[16,1,21,1],[22,1,43,1],[44,1,52,1],[53,1,57,1],[71,2,71,4],[51,2,51,4],[52,2,52,4],[53,2,53,4],[54,2,54,4],[55,2,55,4],[57,2,57,4],[58,2,58,4],[56,2,56,4],[49,2,49,4],[50,2,50,4],[48,2,48,4],[33,2,33,4],[34,2,34,4],[35,2,35,4],[36,2,36,4],[37,2,37,4],[38,2,38,4],[44,2,44,4],[45,2,45,4],[46,2,46,4],[47,2,47,4],[39,2,39,4],[40,2,40,4],[41,2,41,4],[42,2,42,4],[43,2,43,4],[32,2,32,4],[21,2,21,4],[22,2,22,4],[23,2,23,4],[24,2,24,4],[25,2,25,4],[26,2,26,4],[27,2,27,4],[28,2,28,4],[29,2,29,4],[30,2,30,4],[31,2,31,4],[20,2,20,4],[9,2,9,4],[10,2,10,4],[11,2,11,4],[12,2,12,4],[13,2,13,4],[14,2,14,4],[16,2,16,4],[15,2,15,4],[17,2,17,4],[18,2,18,4],[19,2,19,4],[0,1,0,5],[1,1,1,5],[2,1,15,1],[2,2,2,4],[3,2,3,4],[4,2,4,4],[5,2,5,4],[6,2,6,4],[7,2,7,4],[8,2,8,4]]}
[null,{"$f":"Facts_Project_Name & \",  \" & TEXT(Facts_Application_Number, \"APP05-0000\")","v":",  APP24-000"}]
[null,"Project Operations (Year 1)"]
[null,"Admin Expenses","Advertising"]
[null,null,"Office Salaries"]
[null,null,"Office Supplies"]
[null,null,"Office or Model Apartment Rent"]
[null,null,"Management Fee"]
[null,null,"Manager or Superintendent Salaries"]
[null,null,"Manager or Superintendent Rent Free Unit"]
[null,null,"Legal Expenses (Project)"]
[null,null,"Auditing Expenses (Project)"]
[null,null,"Bookkeeping Fees / Accounting Services"]
[null,null,"Telephone and Answering Service"]
[null,null,"Bad Debts"]
[null,null,"Other Administrative Expenses (specify)"]
[null,null,"     Total Administrative Expenses",null,null,{"$f":"SUM(F3:F15)","v":0}]
[null,"Utilities Expense","Fuel / Oil / Coal"]
[null,null,"Electricity (Light and Misc. Power)"]
[null,null,"Water"]
[null,null,"Gas"]
[null,null,"Sewer"]
[null,null,"     Total Utilities Expense",null,null,{"$f":"SUM(F17:F21)","v":0}]
[null,"Operating and Maintenance Expenses","Janitor and Cleaning Payroll"]
[null,null,"Janitor and Cleaning Supplies"]
[null,null,"Janitor and Cleaning Contract"]
[null,null,"Exterminating Payroll / Contract"]
[null,null,"Exterminating Supplies"]
[null,null,"Garbage and Trash Removal"]
[null,null,"Security Payroll / Contract "]
[null,null,"Grounds Payroll"]
{"$rows_left_out":43}
{"sheet":"CF","index":5,"n_rows":104,"n_cols":33,"rows_kept":104,"cut":false,"hidden":false,"merged":[[103,1,103,2],[1,1,1,2],[1,4,1,9],[44,4,44,5],[45,4,45,5],[43,6,43,7],[44,6,44,7],[43,4,43,5]]}
[null,{"$f":"Facts_Project_Name & \",  \" & TEXT(Facts_Application_Number, \"APP05-0000\")","v":",  APP24-000"}]
[null,"Cash Flow Analysis"]
[null,"Income Trend",0.02,"YR 1","YR 2","YR 3","YR 4","YR 5","YR 6","YR 7","YR 8","YR 9","YR 10","YR 11","YR 12","YR 13","YR 14","YR 15","YR 16","YR 17","YR 18","YR 19","YR 20","YR 21","YR 22","YR 23","YR 24","YR 25","YR 26","YR 27","YR 28","YR 29","YR 30"]
[null,"Expense Trend",0.03]
[null,"   Gross Rent",null,{"$f":"LowIncomeRevenueTotal+MarketRevenueTotal","v":0},{"$f":"ROUND(D5*(1+$C$3),0)","v":0},{"$f":"ROUND(E5*(1+$C$3),0)","v":0},0,0,0,0,0,0,0,0,0,0,0,0,0,0,0,0,0,0,0,0,0,0,0,0,0,0,0]
[null,"+ HOME Rent",null,{"$f":"HOMERents","v":0},{"$f":"ROUND(D6*1.015,0)","v":0},{"$f":"ROUND(E6*1.015,0)","v":0},0,0,0,0,0,0,0,0,0,0,0,0,0,0,0,0,0,0,0,0,0,0,0,0,0,0,0]
[null,"+ Stores and Commercial",null,{"$f":"CashFlow_Commercial","v":0},{"$f":"ROUND(D7*(1+$C$3),0)","v":0},{"$f":"ROUND(E7*(1+$C$3),0)","v":0},0,0,0,0,0,0,0,0,0,0,0,0,0,0,0,0,0,0,0,0,0,0,0,0,0,0,0]
[null,"+ Laundry and Vending",null,{"$f":"CashFlow_Laundry","v":0},{"$f":"ROUND(D8*(1+$C$3),0)","v":0},{"$f":"ROUND(E8*(1+$C$3),0)","v":0},0,0,0,0,0,0,0,0,0,0,0,0,0,0,0,0,0,0,0,0,0,0,0,0,0,0,0]
[null,"+ Other Income",null,{"$f":"CashFlow_Other","v":0},{"$f":"ROUND(D9*(1+$C$3),0)","v":0},{"$f":"ROUND(E9*(1+$C$3),0)","v":0},0,0,0,0,0,0,0,0,0,0,0,0,0,0,0,0,0,0,0,0,0,0,0,0,0,0,0]
[null,"= Gross Income",null,{"$f":"SUM(D5:D9)","v":0},{"$f":"SUM(E5:E9)","v":0},0,0,0,0,0,0,0,0,0,0,0,0,0,0,0,0,0,0,0,0,0,0,0,0,0,0,0,0]
[null,"-  7% Vacancy Allowance",null,{"$f":"ROUND(D10*CashFlow_VacancyRate,0)","v":0},0,0,0,0,0,0,0,0,0,0,0,0,0,0,0,0,0,0,0,0,0,0,0,0,0,0,0,0,0]
[null,"= Net Rental Income",null,{"$f":"D10-D11","v":0},{"$f":"E10-E11","v":0},0,0,0,0,0,0,0,0,0,0,0,0,0,0,0,0,0,0,0,0,0,0,0,0,0,0,0,0]
[null,"- Operating Expenses",null,{"$f":"OpBudg!F60-OpBudg!F59","v":0},{"$f":"ROUND(D13*(1+$C$4),0)","v":0},{"$f":"ROUND(E13*(1+$C$4),0)","v":0},0,0,0,0,0,0,0,0,0,0,0,0,0,0,0,0,0,0,0,0,0,0,0,0,0,0,0]
[null,"- Replacement Reserves",null,{"$f":"OpBudg!F59","v":0},{"$f":"ROUND(D14*1.04,0)","v":0},{"$f":"ROUND(E14*1.04,0)","v":0},0,0,0,0,0,0,0,0,0,0,0,0,0,0,0,0,0,0,0,0,0,0,0,0,0,0,0]
[null,"= Net Operating Income",null,{"$f":"D12-SUM(D13:D14)","v":0},0,0,0,0,0,0,0,0,0,0,0,0,0,0,0,0,0,0,0,0,0,0,0,0,0,0,0,0,0]
[null,{"$f":"\"- \"&FS!B5","v":"- Bank Loan"},null,{"$f":"D38","v":0},{"$f":"E38","v":0},0,0,0,0,0,0,0,0,0,0,0,0,0,0,0,0,0,0,0,0,0,0,0,0,0,0,0,0]
[null,{"$f":"\"- \"&FS!B6","v":"- RPLP Loan"},null,{"$f":"D50","v":0},0,0,0,0,0,0,0,0,0,0,0,0,0,0,0,0,0,0,0,0,0,0,0,0,0,0,0,0,0]
[null,{"$f":"\"- \"&FS!B7","v":"- Local Government Loan"},null,{"$f":"D56","v":0},{"$f":"E56","v":0},0,0,0,0,0,0,0,0,0,0,0,0,0,0,0,0,0,0,0,0,0,0,0,0,0,0,0,0]
[null,{"$f":"\"- \"&FS!B8","v":"- RD 515 Loan"},null,{"$f":"D65","v":0},{"$f":"E65","v":0},0,0,0,0,0,0,0,0,0,0,0,0,0,0,0,0,0,0,0,0,0,0,0,0,0,0,0,0]
[null,{"$f":"\"- \"&FS!B9","v":"- RD 538 Loan"},null,{"$f":"D74","v":0},{"$f":"E74","v":0},0,0,0,0,0,0,0,0,0,0,0,0,0,0,0,0,0,0,0,0,0,0,0,0,0,0,0,0]
[null,{"$f":"\"- \"&FS!B10","v":"- AHP Loan"},null,{"$f":"D83","v":0},0,0,0,0,0,0,0,0,0,0,0,0,0,0,0,0,0,0,0,0,0,0,0,0,0,0,0,0,0]
[null,{"$f":"\"- \"&FS!B11","v":"- Other Loan (specify)"},null,{"$f":"D$92","v":0},{"$f":"E$92","v":0},0,0,0,0,0,0,0,0,0,0,0,0,0,0,0,0,0,0,0,0,0,0,0,0,0,0,0,0]
[null,{"$f":"\"- \"&FS!B12","v":"- Other Loan (specify)"},null,{"$f":"FS!$H$12","v":0},{"$f":"FS!$H$12","v":0},{"$f":"FS!$H$12","v":0},{"$f":"FS!$H$12","v":0},{"$f":"FS!$H$12","v":0},{"$f":"FS!$H$12","v":0},{"$f":"FS!$H$12","v":0},{"$f":"FS!$H$12","v":0},{"$f":"FS!$H$12","v":0},{"$f":"FS!$H$12","v":0},{"$f":"FS!$H$12","v":0},{"$f":"FS!$H$12","v":0},{"$f":"FS!$H$12","v":0},{"$f":"FS!$H$12","v":0},{"$f":"FS!$H$12","v":0},{"$f":"FS!$H$12","v":0},{"$f":"FS!$H$12","v":0},{"$f":"FS!$H$12","v":0},{"$f":"FS!$H$12","v":0},{"$f":"FS!$H$12","v":0},{"$f":"FS!$H$12","v":0},{"$f":"FS!$H$12","v":0},{"$f":"FS!$H$12","v":0},{"$f":"FS!$H$12","v":0},{"$f":"FS!$H$12","v":0},{"$f":"FS!$H$12","v":0},{"$f":"FS!$H$12","v":0},{"$f":"FS!$H$12","v":0},{"$f":"FS!$H$12","v":0},{"$f":"FS!$H$12","v":0}]
[null,{"$f":"\"- \"&FS!B13","v":"- Other Loan (specify)"},null,{"$f":"FS!$H$13","v":0},{"$f":"FS!$H$13","v":0},{"$f":"FS!$H$13","v":0},{"$f":"FS!$H$13","v":0},{"$f":"FS!$H$13","v":0},{"$f":"FS!$H$13","v":0},{"$f":"FS!$H$13","v":0},{"$f":"FS!$H$13","v":0},{"$f":"FS!$H$13","v":0},{"$f":"FS!$H$13","v":0},{"$f":"FS!$H$13","v":0},{"$f":"FS!$H$13","v":0},{"$f":"FS!$H$13","v":0},{"$f":"FS!$H$13","v":0},{"$f":"FS!$H$13","v":0},{"$f":"FS!$H$13","v":0},{"$f":"FS!$H$13","v":0},{"$f":"FS!$H$13","v":0},{"$f":"FS!$H$13","v":0},{"$f":"FS!$H$13","v":0},{"$f":"FS!$H$13","v":0},{"$f":"FS!$H$13","v":0},{"$f":"FS!$H$13","v":0},{"$f":"FS!$H$13","v":0},{"$f":"FS!$H$13","v":0},{"$f":"FS!$H$13","v":0},{"$f":"FS!$H$13","v":0},{"$f":"FS!$H$13","v":0},{"$f":"FS!$H$13","v":0},{"$f":"FS!$H$13","v":0}]
[null,{"$f":"\"- \"&FS!B14","v":"- RD 515 Assumed"},null,{"$f":"FS!$H$14","v":0},{"$f":"FS!$H$14","v":0},{"$f":"FS!$H$14","v":0},{"$f":"FS!$H$14","v":0},{"$f":"FS!$H$14","v":0},{"$f":"FS!$H$14","v":0},{"$f":"FS!$H$14","v":0},{"$f":"FS!$H$14","v":0},{"$f":"FS!$H$14","v":0},{"$f":"FS!$H$14","v":0},{"$f":"FS!$H$14","v":0},{"$f":"FS!$H$14","v":0},{"$f":"FS!$H$14","v":0},{"$f":"FS!$H$14","v":0},{"$f":"FS!$H$14","v":0},{"$f":"FS!$H$14","v":0},{"$f":"FS!$H$14","v":0},{"$f":"FS!$H$14","v":0},{"$f":"FS!$H$14","v":0},{"$f":"FS!$H$14","v":0},{"$f":"FS!$H$14","v":0},{"$f":"FS!$H$14","v":0},{"$f":"FS!$H$14","v":0},{"$f":"FS!$H$14","v":0},{"$f":"FS!$H$14","v":0},{"$f":"FS!$H$14","v":0},{"$f":"FS!$H$14","v":0},{"$f":"FS!$H$14","v":0},{"$f":"FS!$H$14","v":0},{"$f":"FS!$H$14","v":0}]
[null,{"$f":"\"- \"&FS!B15","v":"- Tax Exempt Bond"},null,{"$f":"FS!$H$15","v":0},{"$f":"FS!$H$15","v":0},{"$f":"FS!$H$15","v":0},{"$f":"FS!$H$15","v":0},{"$f":"FS!$H$15","v":0},{"$f":"FS!$H$15","v":0},{"$f":"FS!$H$15","v":0},{"$f":"FS!$H$15","v":0},{"$f":"FS!$H$15","v":0},{"$f":"FS!$H$15","v":0},{"$f":"FS!$H$15","v":0},{"$f":"FS!$H$15","v":0},{"$f":"FS!$H$15","v":0},{"$f":"FS!$H$15","v":0},{"$f":"FS!$H$15","v":0},{"$f":"FS!$H$15","v":0},{"$f":"FS!$H$15","v":0},{"$f":"FS!$H$15","v":0},{"$f":"FS!$H$15","v":0},{"$f":"FS!$H$15","v":0},{"$f":"FS!$H$15","v":0},{"$f":"FS!$H$15","v":0},{"$f":"FS!$H$15","v":0},{"$f":"FS!$H$15","v":0},{"$f":"FS!$H$15","v":0},{"$f":"FS!$H$15","v":0},{"$f":"FS!$H$15","v":0},{"$f":"FS!$H$15","v":0},{"$f":"FS!$H$15","v":0},{"$f":"FS!$H$15","v":0}]
[null,"Total Debt Service",null,{"$f":"SUM(D16:D26)","v":0},0,0,0,0,0,0,0,0,0,0,0,0,0,0,0,0,0,0,0,0,0,0,0,0,0,0,0,0,0]
[null,"= Net Cash Flow",null,{"$f":"D15-D27","v":0},0,0,0,0,0,0,0,0,0,0,0,0,0,0,0,0,0,0,0,0,0,0,0,0,0,0,0,0,0]
[]
[null,"Debt Coverage Ratio - Bank Loan",null,{"$f":"IF(ISERR(D15/D16),0,D15/D16)","v":0},0,0,0,0,0,0,0,0,0,0,0,0,0,0,0,0,0,0,0,0,0,0,0,0,0,0,0,0,0]
{"$rows_left_out":75}
{"sheet":"County","index":6,"n_rows":101,"n_cols":4,"rows_kept":101,"cut":false,"hidden":true,"merged":[]}
["County","Region","Median Income (2023)","Income Level"]
["Alamance","C",78800,"M"]
["Alexander","W",71400,"M"]
["Alleghany","W",54900,"L"]
["Anson","C",62700,"L"]
["Ashe","W",64200,"L"]
["Avery","W",66500,"L"]
["Beaufort","E",73000,"M"]
["Bertie","E",59300,"L"]
["Bladen","E",60100,"L"]
["Brunswick","E",89800,"H"]
["Buncombe","M",90300,"H"]
["Burke","W",71400,"M"]
["Cabarrus","C",102800,"H"]
["Caldwell","W",71400,"M"]
["Camden","E",85100,"M"]
["Carteret","E",80600,"M"]
["Caswell","C",71400,"M"]
["Catawba","W",71400,"M"]
["Chatham","C",116200,"H"]
["Cherokee","W",62700,"L"]
["Chowan","E",67500,"L"]
["Clay","W",67900,"L"]
["Cleveland","W",68300,"L"]
["Columbus","E",59400,"L"]
["Craven","E",77100,"M"]
["Cumberland","M",71600,"M"]
["Currituck","E",100500,"H"]
["Dare","E",97400,"H"]
["Davidson","C",70700,"M"]
{"$rows_left_out":72}
{"sheet":"BoardSummary","index":7,"n_rows":34,"n_cols":8,"rows_kept":34,"cut":false,"hidden":true,"merged":[[28,2,28,7],[33,2,33,7],[21,1,21,3],[22,1,22,3],[23,1,23,3],[26,1,26,3],[24,1,24,3],[25,1,25,3],[27,1,27,3],[10,1,10,7],[12,1,12,7],[19,1,19,3],[20,1,20,2],[0,1,0,5],[3,1,3,4],[4,1,4,4],[6,1,6,4],[8,1,8,3],[8,4,8,5]]}
["NAME:",{"$f":"Facts_Project_Name","v":0}]
["RPP LOAN AMOUNT:",{"$f":"FS_RPPLoan_Amount","v":0}]
["WHLP LOAN AMOUNT:",{"$f":"FS_StateWHLP_Amount","v":0}]
["APPLICANT:",{"$f":"Facts_Applicant","v":0}]
["LOCATION:",{"$f":"Facts_County","v":0}]
["MANAGEMENT:"]
["CONTRACTOR:",{"$f":"Facts_Contractor","v":0}]
[]
["TARGETING:",null,null,null,"MEDIAN INCOME:",null,{"$f":"getMedianIncome(Facts_County)","v":{"$error":"#NAME?"}}]
[]
["SUMMARY:"]
[]
["SPONSOR:"]
[]
["UNIT MIX:","Bedrooms","Number of Units","Type","Square Feet","Monthly Rent","Utilities Cost","Monthly Housing Expense"]
[null,null,null,null,null,null,null,{"$f":"F16+G16","v":0}]
[]
[]
["PROJECT COSTS:",null,null,null,"Total","Per Unit"]
[null,"Construction ",null,null,{"$f":"Facts!$E$14","v":0},{"$f":"Facts!$F$14","v":0}]
[null,"Onsite Improvements",null,null,{"$f":"Facts!$E$15","v":0},{"$f":"Facts!$F$15","v":0}]
[null,"Soft Costs",null,null,{"$f":"Facts!$E$17","v":0},{"$f":"Facts!$F$17","v":0}]
[null,"Developer's Fee",null,null,{"$f":"Facts!$E$18","v":0},{"$f":"Facts!$F$18","v":0}]
[null,"Total Development Cost",null,null,{"$f":"SUM(E20:E23)","v":0},{"$f":"SUM(F20:F23)","v":0}]
[null,"Water, Sewer and Impact Fees",null,null,{"$f":"Facts!$E$20","v":0}]
[null,"Land",null,null,{"$f":"Facts!$E$22","v":0}]
[null,"Reserves ",null,null,{"$f":"Facts!$E$21","v":0}]
[null,"Total Replacement Cost",null,null,{"$f":"+E24+E25+E26+E27","v":0}]
[null,"Annotation:"]
[]
{"$rows_left_out":5}
{"sheet":"CreditInfo","index":8,"n_rows":16,"n_cols":14,"rows_kept":16,"cut":false,"hidden":true,"merged":[[14,5,14,6],[14,9,14,10],[14,12,14,13],[15,5,15,6],[15,9,15,10],[15,11,15,13],[13,1,13,2],[13,7,13,8],[1,1,1,13],[10,3,10,4],[10,5,10,6],[10,9,10,10],[10,12,10,13]]}
[]
[null,"Building by Building Credit Allocation"]
[]
[]
[null,"Project Name:",null,null,null,"Was this project in a QCT or DDA when credits were awarded?"]
[]
[null,"Project #:",null,null,null,"Does this project contain Market Rate units?"]
[null,null,null,null,"(if Yes, Applicable Fraction will not populate until Bldg Info page is complete)"]
[]
[]
[null,null,"Address of Building","Placed in Service Date",null,"Eligible Basis",null,"Applicable","QCT / DDA","Qualified Basis",null,"Credit","Credit Amount"]
[null,"BIN","(must be actual street address)","New / Rehab","Acquisition","New / Rehab","Acquisition","Fraction","Boost","New / Rehab","Acquisition","Rate","New / Rehab","Acquistion"]
[null,null,null,null,null,null,null,null,{"$f":"IF(B13=\"\",\"\",IF($E$5=\"\",\"\",IF(E13>0,\"100%\",IF(G13>0,\"100%\",IF($E$5=\"No\",\"100%\",\"130%\")))))","v":""},{"$f":"IF(I13=\"\",\"\",IF(H13=\"\",\"\",IF(F13>0,ROUND(F13*H13*I13,),\"\")))","v":""},{"$f":"IF(G13>0,ROUND(G13*H13,0),\"\")","v":""},null,{"$f":"IF(E13>0,\"\",IF(G13>0,\"\",IF(D13=\"\",\"\",IF(J13=\"\",\"\",IF(F13=\"\",\"\",ROUND(J13*L13,0))))))","v":""},{"$f":"IF(D13>0,\"\",IF(F13>0,\"\",IF(E13=\"\",\"\",IF(K13=\"\",\"\",ROUND(K13*L13,0)))))","v":""}]
[null,null,null,null,null,{"$f":"SUM(F13:F13)","v":0},{"$f":"SUM(G13:G13)","v":0},null,null,{"$f":"SUM(J13:J13)","v":0},{"$f":"SUM(K13:K13)","v":0},null,{"$f":"SUM(M13:M13)","v":0},{"$f":"SUM(N13:N13)","v":0}]
[null,null,null,null,null,{"$f":"F14+G14","v":0},null,null,null,{"$f":"SUM(J14:K14)","v":0},null,null,{"$f":"SUM(M14:N14)","v":0}]
[null,"Note: Acquisition credits should be entered on a separate line from New / Rehab credits",null,null,null,{"$f":"IF(F15<>PDC!$C$64,\"Does not equal Total\",\"\")","v":""},null,null,null,{"$f":"IF(J15<>PDC!$C$68,\"Does not equal Total\",\"\")","v":""},null,{"$f":"IF(M15>PDC!$C$71,\"         Credits exceed amount reserved\",\"\")","v":""}]